{"text_format":"1","workbook":"xlsx","n_sheets":9,"sheets":["README","Scheme_Benefit_Overview","Data","Output","Policy_Info","CF_Calculation","Mortality","Lapse","Benefit_Factor"],"not_rendered":{"charts":0,"images":0,"macros":1,"external_links":0,"defined_names":26,"comments":1,"pivot_tables":0},"unopened":[],"bounds":{"document_bytes":16777216,"sheet_cells":100000,"rows_first":2000,"rows_last":500,"rows_between":2000,"halvings":0,"cell_chars":16384,"cell_head_chars":4096},"cells_cut":0,"cells_raw":0,"read":"whole","date_system":"1900"}

{"sheet":"README","index":0,"n_rows":2,"n_cols":2,"rows_kept":2,"cut":false,"hidden":false,"merged":[]}
[null,"Note： "]
[null,"This excel file is for vba code illustration only and does not reflect any company's real business model"]

{"sheet":"Scheme_Benefit_Overview","index":1,"n_rows":11,"n_cols":4,"rows_kept":11,"cut":false,"hidden":false,"merged":[]}
[]
[null,null,"Life Table","United States, 2021, Life Table"]
[null,null,"Lapse","Corresponding to Laspe rate table"]
[null,null,"Membership","For Ordinary and Senior Staffs only"]
[null,null,"Scheme Service","minimum age 25, subject to a maximum of 40 years"]
[null,null,"Retirement Age",65]
[null,null,"Pension","Ordinary: 2% * Final Salary * Scheme Service"]
[null,null,null,"Senior: 3% * Final Salary * Scheme Service"]
[null,null,"Spouse","No spouse benefit"]
[null,null,"Childern ","No childern benefit"]
[null,null,"Contribution","No contribution"]

{"sheet":"Data","index":2,"n_rows":10,"n_cols":9,"rows_kept":10,"cut":false,"hidden":false,"merged":[]}
["Data as of November 2023"]
[null,"Pension Scheme","Company","Gender","Date of Birth","Date Joined Company","Monthly Salary as of November 2023","Beneficiary","Status"]
[null,"Type A","Sub A","M","1971-02-10","2000-09-02",301200,"Pensioner","Ordinary"]
[]
[]
[]
[null,"Pension Scheme","Company","Gender","Date of Birth","Date Joined Company","Monthly Salary as of November 2023","Beneficiary","Status"]
[null,"Type A","Sub A","M","1971-02-10","2000-09-02",301200,"Pensioner","Ordinary"]
[null,"Type A","Sub A","F","1983-09-06","2008-02-20",420300,"Pensioner","Senior"]
[null,"Type A","Sub A","M","1971-02-10","2000-09-02",301200,"Pensioner","Ordinary"]

{"sheet":"Output","index":3,"n_rows":5,"n_cols":10,"rows_kept":5,"cut":false,"hidden":false,"merged":[]}
["Data as of November 2023"]
[null,{"$f":"Data!B7","v":"Pension Scheme"},{"$f":"Data!C7","v":"Company"},{"$f":"Data!D7","v":"Gender"},{"$f":"Data!E7","v":"Date of Birth"},{"$f":"Data!F7","v":"Date Joined Company"},{"$f":"Data!G7","v":"Monthly Salary as of November 2023"},{"$f":"Data!H7","v":"Beneficiary"},{"$f":"Data!I7","v":"Status"},"Output"]
[null,{"$f":"Data!B8","v":"Type A"},{"$f":"Data!C8","v":"Sub A"},{"$f":"Data!D8","v":"M"},{"$f":"Data!E8","v":"1971-02-10"},{"$f":"Data!F8","v":"2000-09-02"},{"$f":"Data!G8","v":301200},{"$f":"Data!H8","v":"Pensioner"},{"$f":"Data!I8","v":"Ordinary"},10660348.703069342]
[null,{"$f":"Data!B9","v":"Type A"},{"$f":"Data!C9","v":"Sub A"},{"$f":"Data!D9","v":"F"},{"$f":"Data!E9","v":"1983-09-06"},{"$f":"Data!F9","v":"2008-02-20"},{"$f":"Data!G9","v":420300},{"$f":"Data!H9","v":"Pensioner"},{"$f":"Data!I9","v":"Senior"},14198615.467262913]
[null,{"$f":"Data!B10","v":"Type A"},{"$f":"Data!C10","v":"Sub A"},{"$f":"Data!D10","v":"M"},{"$f":"Data!E10","v":"1971-02-10"},{"$f":"Data!F10","v":"2000-09-02"},{"$f":"Data!G10","v":301200},{"$f":"Data!H10","v":"Pensioner"},{"$f":"Data!I10","v":"Ordinary"},10660348.703069342]

{"sheet":"Policy_Info","index":4,"n_rows":18,"n_cols":3,"rows_kept":18,"cut":false,"hidden":false,"merged":[]}
[null,"Policy holder's Information"]
[null,"Valuation Date","2023-12-31"]
[null,"Date of Birth",{"$f":"Data!$E$3","v":"1971-02-10"}]
[null,"Max_Age",100]
[null,"Gender",{"$f":"Data!$D$3","v":"M"}]
[null,"Discount Rate p.a.",0.02]
[null,"Disc Rate monthly",{"$f":"(1+C6)^(1/12)-1","v":1.6515813019202241E-3}]
[null,"Retirement_Age",65]
[null,"Max_Scheme_Service",{"$f":"Retire_age-Schem_Start_Age","v":40}]
[null,"Scheme_Start_Age",25]
[null,"Date Joined Company",{"$f":"Data!$F$3","v":"2000-09-02"}]
[null,"Status",{"$f":"Data!$I$3","v":"Ordinary"}]
[null,"Pension_Factor",{"$f":"VLOOKUP(Status,Benefit_Factor!$B$2:$C$3,2)","v":0.02}]
[null,"Basic Monthly Salary as at November 2023",{"$f":"Data!$G$3","v":301200}]
[null,"Salary_Increase_Rate",0.02]
[null,"Pension_Increase_Rate",5.0000000000000001E-3]
[null,"Current_Service_Year",{"$f":"MIN(YEARFRAC(Joined_date,Val_Date,3),Max_Schem_Service)","v":23.342465753424658}]
[null,"Expect_Service_Year",{"$f":"MAX(Scheme_service)","v":35.435616438356163}]

{"sheet":"CF_Calculation","index":5,"n_rows":904,"n_cols":19,"rows_kept":904,"cut":false,"hidden":false,"merged":[]}
["Date","Att Age","Int Age","Indicator\nRetired: 1","Calender\nMonth","Calender\nYear","Policy\nMonth","Policy\nYear","time","Discount Factor \n(BOM)","qx","Lapse Rate","px","Scheme Service","Salary PP\n(per policy)","Pension PP\n(per policy)","Pension CF\n(cash flow)","PVCF\n（present value of CF)","Obligation"]
["2022-11-30",null,null,null,null,null,null,null,null,null,null,null,1,{"$f":"IF(D3=1,Max_Schem_Service,\"\")","v":""},{"$f":"Monthly_Salary","v":301200}]
[{"$f":"IF(B3=\"\",\"\",EOMONTH(A2,1))","v":"2022-12-31"},{"$f":"YEARFRAC(Birth_Date,Val_Date,3)","v":52.923287671232877},{"$f":"IF(B3=\"\",\"\",INT(B3))","v":52},{"$f":"IF(C3=\"\",\"\",IF(C3>=Retire_age,1,0))","v":0},1,{"$f":"YEAR(Val_Date)+1","v":2024},1,1,{"$f":"0","v":0},1,{"$f":"IF(B3=\"\",\"\",1-(1-VLOOKUP(C3,Mortality!$F$4:$H$105,IF(Gender=\"M\",2,3)))^(1/12))","v":6.4308275338831322E-4},{"$f":"IF(B3=\"\",\"\",1-(1-VLOOKUP(H3,Lapse!$B$3:$C$43,2))^(1/12))","v":8.7416109546967213E-3},{"$f":"IF(B3=\"\",\"\",M2*(1-K3)*(1-L3))","v":0.99062092787115674},{"$f":"IF(B3=\"\",\"\",IF(retire_indicator=1,N2,MIN(YEARFRAC(DATE(Calender_year,Calender_month+1,0),Joined_date,3),Max_Schem_Service)))","v":23.427397260273974},{"$f":"IF(B3=\"\",\"\",IF(retire_indicator=1,O2,Monthly_Salary*(1+Sal_increase_rate_pa)^(Calender_year-YEAR(Val_Date)-1)))","v":301200},{"$f":"IF(B3=\"\",\"\",IF(retire_indicator=1, Pension_factor*Scheme_service*Salary_PP*(1+Pension_increase_rate_pa)^(Calender_year-YEAR(Val_Date)-1),0))","v":0},{"$f":"IF(B3=\"\",\"\",M2*Pension_PP)","v":0},{"$f":"IF(B3=\"\",0,Pension_CF+R4/(1+Disc_Rate_Month))","v":16183210.108626628},{"$f":"PVCF*current_service/except_service","v":10660348.703069342}]
[{"$f":"IF(B4=\"\",\"\",EOMONTH(A3,1))","v":"2023-01-31"},{"$f":"IF(B3=\"\",\"\", IF(B3+1/12>Max_age,\"\",B3+1/12))","v":53.006621004566213},{"$f":"IF(B4=\"\",\"\",INT(B4))","v":53},0,{"$f":"IF(B4=\"\",\"\",IF(E3=12,1,E3+1))","v":2},{"$f":"IF(B4=\"\",\"\",IF(E3=12,F3+1,F3))","v":2024},{"$f":"IF(B4=\"\",\"\",IF(G3=12,1,G3+1))","v":2},{"$f":"IF(B4=\"\",\"\",IF(G3=12,H3+1,H3))","v":1},{"$f":"IF(B4=\"\",\"\",I3+1)","v":1},{"$f":"IF(B4=\"\",\"\",(1+Disc_Rate_Month)^(-I4))","v":0.99835114192125218},{"$f":"IF(B4=\"\",\"\",1-(1-VLOOKUP(C4,Mortality!$F$4:$H$105,IF(Gender=\"M\",2,3)))^(1/12))","v":6.9566557674560769E-4},{"$f":"IF(B4=\"\",\"\",1-(1-VLOOKUP(H4,Lapse!$B$3:$C$43,2))^(1/12))","v":8.7416109546967213E-3},{"$f":"IF(B4=\"\",\"\",M3*(1-K4)*(1-L4))","v":0.98127818843846093},23.506849315068493,301200,0,0,16209937.995847082,10677955.135659281]
["2023-02-28",53.089954337899549,53,0,3,{"$f":"IF(B5=\"\",\"\",IF(E4=12,F4+1,F4))","v":2024},{"$f":"IF(B5=\"\",\"\",IF(G4=12,1,G4+1))","v":3},{"$f":"IF(B5=\"\",\"\",IF(G4=12,H4+1,H4))","v":1},2,0.99670500257546824,{"$f":"IF(B5=\"\",\"\",1-(1-VLOOKUP(C5,Mortality!$F$4:$H$105,IF(Gender=\"M\",2,3)))^(1/12))","v":6.9566557674560769E-4},{"$f":"IF(B5=\"\",\"\",1-(1-VLOOKUP(H5,Lapse!$B$3:$C$43,2))^(1/12))","v":8.7416109546967213E-3},0.97202356220593222,23.591780821917808,301200,0,0,16236710.026346309,10695590.64670408]
["2023-03-31",53.173287671232885,53,0,4,2024,4,1,3,0.99506157747984325,{"$f":"IF(B6=\"\",\"\",1-(1-VLOOKUP(C6,Mortality!$F$4:$H$105,IF(Gender=\"M\",2,3)))^(1/12))","v":6.9566557674560769E-4},{"$f":"IF(B6=\"\",\"\",1-(1-VLOOKUP(H6,Lapse!$B$3:$C$43,2))^(1/12))","v":8.7416109546967213E-3},0.96285621816077194,23.673972602739727,301200,0,0,16263526.273030523,10713255.284229169]
["2023-04-30",53.25662100456622,53,0,5,2024,5,1,4,0.99342086215896408,{"$f":"IF(B7=\"\",\"\",1-(1-VLOOKUP(C7,Mortality!$F$4:$H$105,IF(Gender=\"M\",2,3)))^(1/12))","v":6.9566557674560769E-4},{"$f":"IF(B7=\"\",\"\",1-(1-VLOOKUP(H7,Lapse!$B$3:$C$43,2))^(1/12))","v":8.7416109546967213E-3},0.9537753331276253,23.758904109589039,301200,0,0,16290386.80892635,10730949.0963393]
["2023-05-31",53.339954337899556,53,0,6,2024,6,1,5,0.99178285214479667,{"$f":"IF(B8=\"\",\"\",1-(1-VLOOKUP(C8,Mortality!$F$4:$H$105,IF(Gender=\"M\",2,3)))^(1/12))","v":6.9566557674560769E-4},{"$f":"IF(B8=\"\",\"\",1-(1-VLOOKUP(H8,Lapse!$B$3:$C$43,2))^(1/12))","v":8.7416109546967213E-3},0.94478009169466515,23.841095890410958,301200,0,0,16317291.70718102,10748672.131218672]
["2023-06-30",53.423287671232892,53,0,7,2024,7,1,6,0.99014754297667429,{"$f":"IF(B9=\"\",\"\",1-(1-VLOOKUP(C9,Mortality!$F$4:$H$105,IF(Gender=\"M\",2,3)))^(1/12))","v":6.9566557674560769E-4},{"$f":"IF(B9=\"\",\"\",1-(1-VLOOKUP(H9,Lapse!$B$3:$C$43,2))^(1/12))","v":8.7416109546967213E-3},0.93586968614037247,23.926027397260274,301200,0,0,16344241.041062579,10766424.437131064]
["2023-07-31",53.506621004566227,53,0,8,2024,8,1,7,0.98851493020128489,{"$f":"IF(B10=\"\",\"\",1-(1-VLOOKUP(C10,Mortality!$F$4:$H$105,IF(Gender=\"M\",2,3)))^(1/12))","v":6.9566557674560769E-4},{"$f":"IF(B10=\"\",\"\",1-(1-VLOOKUP(H10,Lapse!$B$3:$C$43,2))^(1/12))","v":8.7416109546967213E-3},0.92704331636100767,24.010958904109589,301200,0,0,16371234.883960074,10784206.062419966]
["2023-08-31",53.589954337899563,53,0,9,2024,9,1,8,0.98688500937265944,{"$f":"IF(B11=\"\",\"\",1-(1-VLOOKUP(C11,Mortality!$F$4:$H$105,IF(Gender=\"M\",2,3)))^(1/12))","v":6.9566557674560769E-4},{"$f":"IF(B11=\"\",\"\",1-(1-VLOOKUP(H11,Lapse!$B$3:$C$43,2))^(1/12))","v":8.7416109546967213E-3},0.91830018979876582,24.093150684931508,301200,0,0,16398273.309383767,10802017.055508714]
["2023-09-30",53.673287671232899,53,0,10,2024,10,1,9,0.98525777605216025,{"$f":"IF(B12=\"\",\"\",1-(1-VLOOKUP(C12,Mortality!$F$4:$H$105,IF(Gender=\"M\",2,3)))^(1/12))","v":6.9566557674560769E-4},{"$f":"IF(B12=\"\",\"\",1-(1-VLOOKUP(H12,Lapse!$B$3:$C$43,2))^(1/12))","v":8.7416109546967213E-3},0.90963952137060922,24.17808219178082,301200,0,0,16425356.390965322,10819857.464900615]
["2023-10-31",53.756621004566234,53,0,11,2024,11,1,10,0.98363322580846757,{"$f":"IF(B13=\"\",\"\",1-(1-VLOOKUP(C13,Mortality!$F$4:$H$105,IF(Gender=\"M\",2,3)))^(1/12))","v":6.9566557674560769E-4},{"$f":"IF(B13=\"\",\"\",1-(1-VLOOKUP(H13,Lapse!$B$3:$C$43,2))^(1/12))","v":8.7416109546967213E-3},0.9010605333977717,24.260273972602739,301200,0,0,16452484.202458017,10837727.339179087]
["2023-11-30",53.83995433789957,53,0,12,2024,12,1,11,0.98201135421756858,{"$f":"IF(B14=\"\",\"\",1-(1-VLOOKUP(C14,Mortality!$F$4:$H$105,IF(Gender=\"M\",2,3)))^(1/12))","v":6.9566557674560769E-4},{"$f":"IF(B14=\"\",\"\",1-(1-VLOOKUP(H14,Lapse!$B$3:$C$43,2))^(1/12))","v":8.7416109546967213E-3},0.89256245553592761,24.345205479452055,301200,0,0,16479656.817736935,10855626.727007786]
["2023-12-31",53.923287671232906,53,0,1,2025,1,2,12,0.98039215686274461,{"$f":"IF(B15=\"\",\"\",1-(1-VLOOKUP(C15,Mortality!$F$4:$H$105,IF(Gender=\"M\",2,3)))^(1/12))","v":6.9566557674560769E-4},{"$f":"IF(B15=\"\",\"\",1-(1-VLOOKUP(H15,Lapse!$B$3:$C$43,2))^(1/12))","v":6.9243826282994192E-3},0.88576538612084366,24.43013698630137,307224,0,0,16506874.310799172,10873555.677130738]
["2024-01-31",54.006621004566242,54,0,2,2025,2,2,13,0.97877562933456053,{"$f":"IF(B16=\"\",\"\",1-(1-VLOOKUP(C16,Mortality!$F$4:$H$105,IF(Gender=\"M\",2,3)))^(1/12))","v":7.5504128274683779E-4},{"$f":"IF(B16=\"\",\"\",1-(1-VLOOKUP(H16,Lapse!$B$3:$C$43,2))^(1/12))","v":6.9243826282994192E-3},0.87896784918902438,24.506849315068493,307224,0,0,16534136.755764036,10891514.238372475]
["2024-02-29",54.089954337899577,54,0,3,2025,3,2,14,0.97716176723085102,{"$f":"IF(B17=\"\",\"\",1-(1-VLOOKUP(C17,Mortality!$F$4:$H$105,IF(Gender=\"M\",2,3)))^(1/12))","v":7.5504128274683779E-4},{"$f":"IF(B17=\"\",\"\",1-(1-VLOOKUP(H17,Lapse!$B$3:$C$43,2))^(1/12))","v":6.9243826282994192E-3},0.87222247788600871,24.591780821917808,307224,0,0,16561444.226873247,10909502.459638167]
["2024-03-31",54.173287671232913,54,0,4,2025,4,2,15,0.97555056615670888,{"$f":"IF(B18=\"\",\"\",1-(1-VLOOKUP(C18,Mortality!$F$4:$H$105,IF(Gender=\"M\",2,3)))^(1/12))","v":7.5504128274683779E-4},{"$f":"IF(B18=\"\",\"\",1-(1-VLOOKUP(H18,Lapse!$B$3:$C$43,2))^(1/12))","v":6.9243826282994192E-3},0.86552887188255156,24.673972602739727,307224,0,0,16588796.798491145,10927520.389913758]
["2024-04-30",54.256621004566249,54,0,5,2025,5,2,16,0.97394202172447419,{"$f":"IF(B19=\"\",\"\",1-(1-VLOOKUP(C19,Mortality!$F$4:$H$105,IF(Gender=\"M\",2,3)))^(1/12))","v":7.5504128274683779E-4},{"$f":"IF(B19=\"\",\"\",1-(1-VLOOKUP(H19,Lapse!$B$3:$C$43,2))^(1/12))","v":6.9243826282994192E-3},0.8588866339216128,24.758904109589039,307224,0,0,16616194.545104887,10945568.078266094]
["2024-05-31",54.339954337899584,54,0,6,2025,6,2,17,0.97233612955372184,{"$f":"IF(B20=\"\",\"\",1-(1-VLOOKUP(C20,Mortality!$F$4:$H$105,IF(Gender=\"M\",2,3)))^(1/12))","v":7.5504128274683779E-4},{"$f":"IF(B20=\"\",\"\",1-(1-VLOOKUP(H20,Lapse!$B$3:$C$43,2))^(1/12))","v":6.9243826282994192E-3},0.85229536979478049,24.841095890410958,307224,0,0,16643637.541324651,10963645.573843053]
["2024-06-30",54.42328767123292,54,0,7,2025,7,2,18,0.97073288527124879,{"$f":"IF(B21=\"\",\"\",1-(1-VLOOKUP(C21,Mortality!$F$4:$H$105,IF(Gender=\"M\",2,3)))^(1/12))","v":7.5504128274683779E-4},{"$f":"IF(B21=\"\",\"\",1-(1-VLOOKUP(H21,Lapse!$B$3:$C$43,2))^(1/12))","v":6.9243826282994192E-3},0.84575468831887535,24.926027397260274,307224,0,0,16671125.86188384,10981752.925873691]
["2024-07-31",54.506621004566256,54,0,8,2025,8,2,19,0.96913228451106315,{"$f":"IF(B22=\"\",\"\",1-(1-VLOOKUP(C22,Mortality!$F$4:$H$105,IF(Gender=\"M\",2,3)))^(1/12))","v":7.5504128274683779E-4},{"$f":"IF(B22=\"\",\"\",1-(1-VLOOKUP(H22,Lapse!$B$3:$C$43,2))^(1/12))","v":6.9243826282994192E-3},0.83926420131273427,25.010958904109589,307224,0,0,16698659.581639286,10999890.183668373]
["2024-08-31",54.589954337899592,54,0,9,2025,9,2,20,0.96753432291437169,{"$f":"IF(B23=\"\",\"\",1-(1-VLOOKUP(C23,Mortality!$F$4:$H$105,IF(Gender=\"M\",2,3)))^(1/12))","v":7.5504128274683779E-4},{"$f":"IF(B23=\"\",\"\",1-(1-VLOOKUP(H23,Lapse!$B$3:$C$43,2))^(1/12))","v":6.9243826282994192E-3},0.83282352357417244,25.093150684931508,307224,0,0,16726238.775571452,11018057.396618893]
["2024-09-30",54.673287671232927,54,0,10,2025,10,2,21,0.96593899612956846,{"$f":"IF(B24=\"\",\"\",1-(1-VLOOKUP(C24,Mortality!$F$4:$H$105,IF(Gender=\"M\",2,3)))^(1/12))","v":7.5504128274683779E-4},{"$f":"IF(B24=\"\",\"\",1-(1-VLOOKUP(H24,Lapse!$B$3:$C$43,2))^(1/12))","v":6.9243826282994192E-3},0.82643227285712206,25.17808219178082,307224,0,0,16753863.518784638,11036254.614198633]
["2024-10-31",54.756621004566263,54,0,11,2025,11,2,22,0.96434629981222286,{"$f":"IF(B25=\"\",\"\",1-(1-VLOOKUP(C25,Mortality!$F$4:$H$105,IF(Gender=\"M\",2,3)))^(1/12))","v":7.5504128274683779E-4},{"$f":"IF(B25=\"\",\"\",1-(1-VLOOKUP(H25,Lapse!$B$3:$C$43,2))^(1/12))","v":6.9243826282994192E-3},0.82009006984894628,25.260273972602739,307224,0,0,16781533.886507187,11054481.885962674]
["2024-11-30",54.839954337899599,54,0,12,2025,12,2,23,0.96275622962506691,{"$f":"IF(B26=\"\",\"\",1-(1-VLOOKUP(C26,Mortality!$F$4:$H$105,IF(Gender=\"M\",2,3)))^(1/12))","v":7.5504128274683779E-4},{"$f":"IF(B26=\"\",\"\",1-(1-VLOOKUP(H26,Lapse!$B$3:$C$43,2))^(1/12))","v":6.9243826282994192E-3},0.81379653814792774,25.345205479452055,307224,0,0,16809249.954091683,11072739.261547947]
["2024-12-31",54.923287671232934,54,0,1,2026,1,3,24,0.96116878123798455,{"$f":"IF(B27=\"\",\"\",1-(1-VLOOKUP(C27,Mortality!$F$4:$H$105,IF(Gender=\"M\",2,3)))^(1/12))","v":7.5504128274683779E-4},{"$f":"IF(B27=\"\",\"\",1-(1-VLOOKUP(H27,Lapse!$B$3:$C$43,2))^(1/12))","v":6.0293080661268927E-3},0.80827916284246115,25.43013698630137,313368.48,0,0,16837011.797015164,11091026.790673358]
["2025-01-31",55.00662100456627,55,0,2,2026,2,3,25,0.95958395032800015,{"$f":"IF(B28=\"\",\"\",1-(1-VLOOKUP(C28,Mortality!$F$4:$H$105,IF(Gender=\"M\",2,3)))^(1/12))","v":8.1649367993985589E-4},{"$f":"IF(B28=\"\",\"\",1-(1-VLOOKUP(H28,Lapse!$B$3:$C$43,2))^(1/12))","v":6.0293080661268927E-3},0.80274982300913322,25.506849315068493,313368.48,0,0,16864819.490879323,11109344.523139929]
["2025-02-28",55.089954337899606,55,0,3,2026,3,3,26,0.95800173257926513,{"$f":"IF(B29=\"\",\"\",1-(1-VLOOKUP(C29,Mortality!$F$4:$H$105,IF(Gender=\"M\",2,3)))^(1/12))","v":8.1649367993985589E-4},{"$f":"IF(B29=\"\",\"\",1-(1-VLOOKUP(H29,Lapse!$B$3:$C$43,2))^(1/12))","v":6.0293080661268927E-3},0.79725830871974834,25.591780821917808,313368.48,0,0,16892673.111410718,11127692.508830937]
["2025-03-31",55.173287671232941,55,0,4,2026,4,3,27,0.95642212368304735,{"$f":"IF(B30=\"\",\"\",1-(1-VLOOKUP(C30,Mortality!$F$4:$H$105,IF(Gender=\"M\",2,3)))^(1/12))","v":8.1649367993985589E-4},{"$f":"IF(B30=\"\",\"\",1-(1-VLOOKUP(H30,Lapse!$B$3:$C$43,2))^(1/12))","v":6.0293080661268927E-3},0.79180436121434294,25.673972602739727,313368.48,0,0,16920572.734460976,11146070.797712039]
{"$rows_left_out":875}
{"sheet":"Mortality","index":6,"n_rows":106,"n_cols":8,"rows_kept":106,"cut":false,"hidden":false,"merged":[[1,0,3,0]]}
[null,"United States, 2021, Life Table"]
["Age (years)","Probability of dying between ages x and x + 1","Probability of dying between ages x and x + 1","Probability of dying between ages x and x + 1"]
[null,"For Total Population","For Male","For Female",null,null,"qx"]
[null,"qx","qx","qx",null,"Age","Male","Female"]
["0–1",5.4456894285976887E-3,5.8331689797341824E-3,5.0404188223183155E-3,null,0,{"$f":"C5","v":5.8331689797341824E-3},{"$f":"D5","v":5.0404188223183155E-3}]
["1–2",4.0257113869301975E-4,4.1591847548261285E-4,3.8860965287312865E-4,null,1,{"$f":"C6","v":4.1591847548261285E-4},{"$f":"D6","v":3.8860965287312865E-4}]
["2–3",2.5423662737011909E-4,2.7402312844060361E-4,2.3353885626420379E-4,null,2,2.7402312844060361E-4,2.3353885626420379E-4]
["3–4",1.9188706937711686E-4,2.2409616212826222E-4,1.5820088447071612E-4,null,3,2.2409616212826222E-4,1.5820088447071612E-4]
["4–5",1.6135034093167633E-4,1.7514948558527976E-4,1.4692246622871608E-4,null,4,1.7514948558527976E-4,1.4692246622871608E-4]
["5–6",1.4286641089711338E-4,1.6083884111139923E-4,1.2407802569214255E-4,null,5,1.6083884111139923E-4,1.2407802569214255E-4]
["6–7",1.2990891991648823E-4,1.4946643204893917E-4,1.0946136899292469E-4,null,6,1.4946643204893917E-4,1.0946136899292469E-4]
["7–8",1.1903545237146318E-4,1.372527185594663E-4,9.9979864899069071E-5,null,7,1.372527185594663E-4,9.9979864899069071E-5]
["8–9",1.0711317008826882E-4,1.1919617099920288E-4,9.4462389824911952E-5,null,8,1.1919617099920288E-4,9.4462389824911952E-5]
["9–10",9.548611706122756E-5,9.7952492069453001E-5,9.2900510935578495E-5,null,9,9.7952492069453001E-5,9.2900510935578495E-5]
["10–11",8.9930807007476687E-5,8.372891170438379E-5,9.6441173809580505E-5,null,10,8.372891170438379E-5,9.6441173809580505E-5]
["11–12",9.9826858786400408E-5,9.280726226279512E-5,1.072037557605654E-4,null,11,9.280726226279512E-5,1.072037557605654E-4]
["12–13",1.3597050565294921E-4,1.4378722698893398E-4,1.2775199138559401E-4,null,12,1.4378722698893398E-4,1.2775199138559401E-4]
["13–14",2.0466900605242699E-4,2.4757889332249761E-4,1.5957391588017344E-4,null,13,2.4757889332249761E-4,1.5957391588017344E-4]
["14–15",2.9889415600337088E-4,3.9240357000380754E-4,2.0073178166057914E-4,null,14,3.9240357000380754E-4,2.0073178166057914E-4]
["15–16",4.0521225309930742E-4,5.5566843366250396E-4,2.4748616851866245E-4,null,15,5.5566843366250396E-4,2.4748616851866245E-4]
["16–17",5.1305291708558798E-4,7.1945239324122667E-4,2.9695962439291179E-4,null,16,7.1945239324122667E-4,2.9695962439291179E-4]
["17–18",6.2297936528921127E-4,8.8465219596400857E-4,3.4934439463540912E-4,null,17,8.8465219596400857E-4,3.4934439463540912E-4]
["18–19",7.3082762537524104E-4,1.0441638296470046E-3,4.0348529000766575E-4,null,18,1.0441638296470046E-3,4.0348529000766575E-4]
["19–20",8.3695835201069713E-4,1.1988714104518294E-3,4.591793694999069E-4,null,19,1.1988714104518294E-3,4.591793694999069E-4]
["20–21",9.4932049978524446E-4,1.3608257286250591E-3,5.2017858251929283E-4,null,20,1.3608257286250591E-3,5.2017858251929283E-4]
["21–22",1.0648098541423678E-3,1.5267692506313324E-3,5.8359105605632067E-4,null,21,1.5267692506313324E-3,5.8359105605632067E-4]
["22–23",1.1698512826114893E-3,1.6776453703641891E-3,6.4147496595978737E-4,null,22,1.6776453703641891E-3,6.4147496595978737E-4]
["23–24",1.2585790827870369E-3,1.8053704407066107E-3,6.9023179821670055E-4,null,23,1.8053704407066107E-3,6.9023179821670055E-4]
["24–25",1.3349205255508423E-3,1.9145358819514513E-3,7.3310028528794646E-4,null,24,1.9145358819514513E-3,7.3310028528794646E-4]
["25–26",1.4056087238714099E-3,2.0147571340203285E-3,7.7369000064209104E-4,null,25,2.0147571340203285E-3,7.7369000064209104E-4]
{"$rows_left_out":77}
{"sheet":"Lapse","index":7,"n_rows":43,"n_cols":3,"rows_kept":43,"cut":false,"hidden":false,"merged":[]}
[null,"Lapse/Terminal Rate Assumption"]
[null,"Policy Year","Rate"]
[null,1,0.1]
[null,2,0.08]
[null,3,7.0000000000000007E-2]
[null,4,0.06]
[null,5,0.05]
[null,6,0.04]
[null,7,0.03]
[null,8,0.02]
[null,9,0.02]
[null,10,0.02]
[null,11,0.02]
[null,12,0.02]
[null,13,0.02]
[null,14,0.02]
[null,15,0.02]
[null,16,0.02]
[null,17,0.02]
[null,18,0.02]
[null,19,0.02]
[null,20,0.02]
[null,21,0.02]
[null,22,0.02]
[null,23,0.02]
[null,24,0.02]
[null,25,0.02]
[null,26,0.02]
[null,27,0.02]
[null,28,0.02]
{"$rows_left_out":14}
{"sheet":"Benefit_Factor","index":8,"n_rows":3,"n_cols":3,"rows_kept":3,"cut":false,"hidden":false,"merged":[]}
[null,"Pension Benefit Factor"]
[null,"Ordinary",0.02]
[null,"Senior",0.03]